Target
Glucocorticoid receptor
Ligand
BDBM50334957
Substrate
Meas. Tech.
ChEMBL_702551 (CHEMBL1657195)
EC50
130000±n/a nM
Citation
 Gilmer, JFPrichard, DMajer, FByrne, AMKelleher, DLong, ASharma, R Ursodeoxycholic acid amides as novel glucocorticoid receptor modulators. J Med Chem 54:122-30 (2011)  
Target
Name:
Glucocorticoid receptor
Synonyms:
GCR_HUMAN GRL Glucocorticoid receptor (GRFP) Nuclear receptor subfamily 3 group C member 1
Type:
Enzyme
Mol. Mass.:
85656.87
Organism:
Homo sapiens (Human)
Description:
P04150
Residue:
777
  
Inhibitor
Name:
BDBM50334957
Synonyms:
(S)-2-((3R,5S,7S,8R,9S,10S,13R,14S,17R)-3,7-dihydroxy-10,13-dimethylhexadecahydro-1H-cyclopenta[a]phenanthren-17-yl)propanenitrile CHEMBL1255076
Type:
Small organic molecule
Emp. Form.:
C22H35NO2
Mol. Mass.:
345.5188
SMILES:
C[C@H](C#N)[C@H]1CC[C@H]2[C@@H]3[C@@H](O)C[C@@H]4C[C@H](O)CC[C@]4(C)[C@H]3CC[C@]12C
: