Target
Delta-type opioid receptor
Ligand
BDBM50334994
Substrate
Meas. Tech.
ChEMBL_702694 (CHEMBL1657768)
EC50
0.070000±n/a nM
Citation
 Cowell, SMHanlon, KE Development of potent µ and d opioid agonists with high lipophilicity. J Med Chem 54:382-6 (2011)  
Target
Name:
Delta-type opioid receptor
Synonyms:
D-OR-1 Delta opioid receptor OPIATE Delta OPRD1 OPRK1 | opioid receptor, delta 1
Type:
G Protein-Coupled Receptor (GPCR)
Mol. Mass.:
40382.98
Organism:
Homo sapiens (Human)
Description:
Competition binding assays were carried out using membrane preparations from transfected HN9.10 cells that constitutively expressed the delta opioid receptor.
Residue:
372
  
Inhibitor
Name:
BDBM50334994
Synonyms:
(R)-2-((S)-2-amino-3-(4-hydroxy-2,6-dimethylphenyl)propanamido)-N-(2-((S)-3-(4-chlorophenyl)-1-oxo-1-(4-(N-phenylpropionamido)piperidin-1-yl)propan-2-ylamino)-2-oxoethyl)hexanamide | CHEMBL1649941
Type:
Small organic molecule
Emp. Form.:
C42H55ClN6O6
Mol. Mass.:
775.376
SMILES:
CCCC[C@@H](NC(=O)[C@@H](N)Cc1c(C)cc(O)cc1C)C(=O)NCC(=O)N[C@@H](Cc1ccc(Cl)cc1)C(=O)N1CCC(CC1)N(C(=O)CC)c1ccccc1
: