Target
Delta-type opioid receptor
Ligand
BDBM50334990
Substrate
Meas. Tech.
ChEMBL_702698 (CHEMBL1657772)
IC50
0.210000±n/a nM
Citation
 Cowell, SMHanlon, KE Development of potent µ and d opioid agonists with high lipophilicity. J Med Chem 54:382-6 (2011)  
Target
Name:
Delta-type opioid receptor
Synonyms:
DOR-1 MSL-2 OPRD_MOUSE Oprd1
Type:
Enzyme Catalytic Domain
Mol. Mass.:
40577.25
Organism:
MOUSE
Description:
P32300
Residue:
372
  
Inhibitor
Name:
BDBM50334990
Synonyms:
(R)-2-((S)-2-amino-3-(4-hydroxy-2,6-dimethylphenyl)propanoyl)-N-(2-((S)-3-(4-chlorophenyl)-1-oxo-1-(4-(N-phenylpropionamido)piperidin-1-yl)propan-2-ylamino)-2-oxoethyl)-1,2,3,4-tetrahydroisoquinoline-3-carboxamide | CHEMBL1649948
Type:
Small organic molecule
Emp. Form.:
C46H53ClN6O6
Mol. Mass.:
821.403
SMILES:
CCC(=O)N(C1CCN(CC1)C(=O)[C@H](Cc1ccc(Cl)cc1)NC(=O)CNC(=O)[C@H]1Cc2ccccc2CN1C(=O)[C@@H](N)Cc1c(C)cc(O)cc1C)c1ccccc1
: