Target
Sodium/glucose cotransporter 2
Ligand
BDBM50335137
Substrate
Meas. Tech.
ChEMBL_702889 (CHEMBL1655514)
EC50
633±n/a nM
Citation
 Chang, CCChao, YSChen, CTChiu, CHChu, KFHsiao, WCHsieh, CJYuan, MCHsieh, TCHuang, CYHung, MSLee, JCLiu, YWSong, JSTsai, CHWang, MHWu, SHYao, CHYeh, TK Discovery of novel N-ß-D-xylosylindole derivatives as sodium-dependent glucose cotransporter 2 (SGLT2) inhibitors for the management of hyperglycemia in diabetes. J Med Chem 54:166-78 (2011)  
Target
Name:
Sodium/glucose cotransporter 2
Synonyms:
Na(+)/glucose cotransporter 2 SGLT2 Sodium-Dependent Glucose Cotransporter 2 (SGLT2) Solute carrier family 5 member 2
Type:
Protein
Mol. Mass.:
72902.00
Organism:
Homo sapiens (Human)
Description:
P31639
Residue:
672
  
Inhibitor
Name:
BDBM50335137
Synonyms:
4-Chloro-3-(6-methoxy-2-naphthylmethyl)-1-(beta-D-xylopyranosyl)-1H-indole | CHEMBL1650493
Type:
Small organic molecule
Emp. Form.:
C25H24ClNO5
Mol. Mass.:
453.915
SMILES:
COc1ccc2cc(Cc3cn([C@@H]4OC[C@@H](O)[C@H](O)[C@H]4O)c4cccc(Cl)c34)ccc2c1
: