Target
Tyrosine-protein kinase JAK3
Ligand
BDBM50335217
Substrate
Meas. Tech.
ChEMBL_701698 (CHEMBL1656590)
IC50
>30000±n/a nM
Citation
 Ioannidis, SLamb, MLWang, TAlmeida, LBlock, MHDavies, AMPeng, BSu, MZhang, HJHoffmann, ERivard, CGreen, IHoward, TPollard, HRead, JAlimzhanov, MBebernitz, GBell, KYe, MHuszar, DZinda, M Discovery of 5-chloro-N2-[(1S)-1-(5-fluoropyrimidin-2-yl)ethyl]-N4-(5-methyl-1H-pyrazol-3-yl)pyrimidine-2,4-diamine (AZD1480) as a novel inhibitor of the Jak/Stat pathway. J Med Chem 54:262-76 (2011)  
Target
Name:
Tyrosine-protein kinase JAK3
Synonyms:
JAK-3 JAK3_HUMAN Janus kinase 3 (JAK3) L-JAK | Leukocyte janus kinase
Type:
Protein
Mol. Mass.:
125111.08
Organism:
Homo sapiens (Human)
Description:
P52333
Residue:
1124
  
Inhibitor
Name:
BDBM50335217
Synonyms:
5-fluoro-N2-[(1S)-1-(5-fluoropyrimidin-2-yl)ethyl]-N4-(5-methyl-1H-pyrazol-3-yl)-6-morpholin-4-ylpyrimidine-2,4-diamine | CHEMBL1650733
Type:
Small organic molecule
Emp. Form.:
C18H21F2N9O
Mol. Mass.:
417.4158
SMILES:
C[C@H](Nc1nc(Nc2cc(C)n[nH]2)c(F)c(n1)N1CCOCC1)c1ncc(F)cn1
: