Target
Signal transducer and activator of transcription 5A
Ligand
BDBM50335201
Substrate
Meas. Tech.
ChEMBL_701827 (CHEMBL1656964)
IC50
41±n/a nM
Citation
 Ioannidis, SLamb, MLWang, TAlmeida, LBlock, MHDavies, AMPeng, BSu, MZhang, HJHoffmann, ERivard, CGreen, IHoward, TPollard, HRead, JAlimzhanov, MBebernitz, GBell, KYe, MHuszar, DZinda, M Discovery of 5-chloro-N2-[(1S)-1-(5-fluoropyrimidin-2-yl)ethyl]-N4-(5-methyl-1H-pyrazol-3-yl)pyrimidine-2,4-diamine (AZD1480) as a novel inhibitor of the Jak/Stat pathway. J Med Chem 54:262-76 (2011)  
Target
Name:
Signal transducer and activator of transcription 5A
Synonyms:
STA5A_HUMAN STAT5A Transcription factor STAT5a (STAT5a)
Type:
Protein
Mol. Mass.:
90643.89
Organism:
Homo sapiens (Human)
Description:
Residue:
794
  
Inhibitor
Name:
BDBM50335201
Synonyms:
5-Chloro-N2-[(1S)-1-(5-fluoropyrimidin-2-yl)ethyl]-N4-(5-methyl-1H-pyrazol-3-yl)pyrimidine-2,4-diamine | CHEMBL1231124
Type:
Small organic molecule
Emp. Form.:
C14H14ClFN8
Mol. Mass.:
348.766
SMILES:
C[C@H](Nc1ncc(Cl)c(Nc2cc(C)n[nH]2)n1)c1ncc(F)cn1
: