Target
Metabotropic glutamate receptor 2
Ligand
BDBM50335251
Substrate
Meas. Tech.
ChEMBL_702751 (CHEMBL1657825)
EC50
80±n/a nM
Citation
 Dhanya, RPSidique, SSheffler, DJNickols, HHHerath, AYang, LDahl, RArdecky, RSemenova, SMarkou, AConn, PJCosford, ND Design and synthesis of an orally active metabotropic glutamate receptor subtype-2 (mGluR2) positive allosteric modulator (PAM) that decreases cocaine self-administration in rats. J Med Chem 54:342-53 (2011)  
Target
Name:
Metabotropic glutamate receptor 2
Synonyms:
GPRC1B GRM2_HUMAN Metabotropic glutamate receptor mGlu2 | metabotropic glutamate 2
Type:
Enzyme
Mol. Mass.:
95584.88
Organism:
Homo sapiens (Human)
Description:
Q14416
Residue:
872
  
Inhibitor
Name:
BDBM50335251
Synonyms:
4-Chloro-3'-((2-(cyclopropylmethyl)-1-oxoisoindolin-5-yloxy)-methyl)biphenyl-3-carboxylic Acid | CHEMBL1651210
Type:
Small organic molecule
Emp. Form.:
C26H22ClNO4
Mol. Mass.:
447.91
SMILES:
OC(=O)c1cc(ccc1Cl)-c1cccc(COc2ccc3C(=O)N(CC4CC4)Cc3c2)c1
: