Target
Translocator protein
Ligand
BDBM50335268
Substrate
Meas. Tech.
ChEMBL_702766 (CHEMBL1655209)
Ki
1.07±n/a nM
Citation
 Pike, VWTaliani, SLohith, TGOwen, DRPugliesi, IDa Pozzo, EHong, JZoghbi, SSGunn, RNParker, CARabiner, EAFujita, MInnis, RBMartini, CDa Settimo, F Evaluation of novel N1-methyl-2-phenylindol-3-ylglyoxylamides as a new chemotype of 18 kDa translocator protein-selective ligand suitable for the development of positron emission tomography radioligands. J Med Chem 54:366-73 (2011)  
Target
Name:
Translocator protein
Synonyms:
Benzodiazepine receptors; peripheral & central Mbr PBR Peripheral benzodiazepine receptor (PBR) TSPO_RAT | Tspo
Type:
Mitochondrion membrane protein
Mol. Mass.:
18945.84
Organism:
Rattus norvegicus (rat)
Description:
Competitive binding experiments were performed on rat kidney mitochondrial membranes.
Residue:
169
  
Inhibitor
Name:
BDBM50335268
Synonyms:
2-(2-(4-fluorophenyl)-1-methyl-1H-indol-3-yl)-N,N-dihexyl-2-oxoacetamide | CHEMBL1651234
Type:
Small organic molecule
Emp. Form.:
C29H37FN2O2
Mol. Mass.:
464.6147
SMILES:
CCCCCCN(CCCCCC)C(=O)C(=O)c1c(-c2ccc(F)cc2)n(C)c2ccccc12
: