Target
Steroid hormone receptor ERR1
Ligand
BDBM50336733
Substrate
Meas. Tech.
ChEMBL_718275 (CHEMBL1679579)
IC50
890±n/a nM
Citation
 Patch, RJSearle, LLKim, AJDe, DZhu, XAskari, HBO'Neill, JCAbad, MCRentzeperis, DLiu, JKemmerer, MLin, LKasturi, JGeisler, JGLenhard, JMPlayer, MRGaul, MD Identification of diaryl ether-based ligands for estrogen-related receptora as potential antidiabetic agents. J Med Chem 54:788-808 (2012)  
Target
Name:
Steroid hormone receptor ERR1
Synonyms:
ERR-alpha ERR1_HUMAN ESRRA Estrogen-Related Receptor, alpha NR3B1 Steroid hormone receptor ERR1 Steroid hormone receptor ERR1/Estrogen-related receptor alpha (ERRa) | von Hippel-Lindau disease tumor suppressor/Steroid hormone receptor ERR1
Type:
PROTEIN
Mol. Mass.:
45508.08
Organism:
Homo sapiens (Human)
Description:
ChEMBL_1499891
Residue:
423
  
Inhibitor
Name:
BDBM50336733
Synonyms:
4-[4-(2,4-Dioxothiazolidin-5-ylidenemethyl)-2-methoxyphenoxy]-2-methylbenzonitrile | CHEMBL1671976
Type:
Small organic molecule
Emp. Form.:
C19H14N2O4S
Mol. Mass.:
366.39
SMILES:
COc1cc(C=C2SC(O)=NC2=O)ccc1Oc1ccc(C#N)c(C)c1
: