Target
Steroid hormone receptor ERR1
Ligand
BDBM50336756
Substrate
Meas. Tech.
ChEMBL_718275 (CHEMBL1679579)
IC50
80±n/a nM
Citation
 Patch, RJSearle, LLKim, AJDe, DZhu, XAskari, HBO'Neill, JCAbad, MCRentzeperis, DLiu, JKemmerer, MLin, LKasturi, JGeisler, JGLenhard, JMPlayer, MRGaul, MD Identification of diaryl ether-based ligands for estrogen-related receptora as potential antidiabetic agents. J Med Chem 54:788-808 (2012)  
Target
Name:
Steroid hormone receptor ERR1
Synonyms:
ERR-alpha ERR1_HUMAN ESRRA Estrogen-Related Receptor, alpha NR3B1 Steroid hormone receptor ERR1 Steroid hormone receptor ERR1/Estrogen-related receptor alpha (ERRa) | von Hippel-Lindau disease tumor suppressor/Steroid hormone receptor ERR1
Type:
PROTEIN
Mol. Mass.:
45508.08
Organism:
Homo sapiens (Human)
Description:
ChEMBL_1499891
Residue:
423
  
Inhibitor
Name:
BDBM50336756
Synonyms:
4-[4-(2,4-Dioxothiazolidin-5-ylidenemethyl)-2-methoxyphenoxy]-3-bromobenzoic Acid Methyl Ester | CHEMBL1671966
Type:
Small organic molecule
Emp. Form.:
C19H14BrNO6S
Mol. Mass.:
464.287
SMILES:
COC(=O)c1ccc(Oc2ccc(C=C3SC(O)=NC3=O)cc2OC)c(Br)c1
: