Target
Steroid hormone receptor ERR1
Ligand
BDBM50336760
Substrate
Meas. Tech.
ChEMBL_718275 (CHEMBL1679579)
IC50
36±n/a nM
Citation
 Patch, RJSearle, LLKim, AJDe, DZhu, XAskari, HBO'Neill, JCAbad, MCRentzeperis, DLiu, JKemmerer, MLin, LKasturi, JGeisler, JGLenhard, JMPlayer, MRGaul, MD Identification of diaryl ether-based ligands for estrogen-related receptora as potential antidiabetic agents. J Med Chem 54:788-808 (2012)  
Target
Name:
Steroid hormone receptor ERR1
Synonyms:
ERR-alpha ERR1_HUMAN ESRRA Estrogen-Related Receptor, alpha NR3B1 Steroid hormone receptor ERR1 Steroid hormone receptor ERR1/Estrogen-related receptor alpha (ERRa) | von Hippel-Lindau disease tumor suppressor/Steroid hormone receptor ERR1
Type:
PROTEIN
Mol. Mass.:
45508.08
Organism:
Homo sapiens (Human)
Description:
ChEMBL_1499891
Residue:
423
  
Inhibitor
Name:
BDBM50336760
Synonyms:
5-[4-(2,4-Bis-trifluoromethylphenoxy)-3-methoxybenzylidene]-thiazolidine-2,4-dione | CHEMBL1671970
Type:
Small organic molecule
Emp. Form.:
C19H11F6NO4S
Mol. Mass.:
463.35
SMILES:
COc1cc(C=C2SC(O)=NC2=O)ccc1Oc1ccc(cc1C(F)(F)F)C(F)(F)F
: