Target
Steroid hormone receptor ERR1
Ligand
BDBM22420
Substrate
Meas. Tech.
ChEMBL_718350 (CHEMBL1679770)
IC50
190±n/a nM
Citation
 Patch, RJSearle, LLKim, AJDe, DZhu, XAskari, HBO'Neill, JCAbad, MCRentzeperis, DLiu, JKemmerer, MLin, LKasturi, JGeisler, JGLenhard, JMPlayer, MRGaul, MD Identification of diaryl ether-based ligands for estrogen-related receptora as potential antidiabetic agents. J Med Chem 54:788-808 (2012)  
Target
Name:
Steroid hormone receptor ERR1
Synonyms:
ERR-alpha ERR1_HUMAN ESRRA Estrogen-Related Receptor, alpha NR3B1 Steroid hormone receptor ERR1 Steroid hormone receptor ERR1/Estrogen-related receptor alpha (ERRa) | von Hippel-Lindau disease tumor suppressor/Steroid hormone receptor ERR1
Type:
PROTEIN
Mol. Mass.:
45508.08
Organism:
Homo sapiens (Human)
Description:
ChEMBL_1499891
Residue:
423
  
Inhibitor
Name:
BDBM22420
Synonyms:
(cyclohexylmethyl)({[1-(4-methylphenyl)-1H-indol-3-yl]methyl})amine Inverse agonist
Type:
Small organic molecule
Emp. Form.:
C23H28N2
Mol. Mass.:
332.4818
SMILES:
Cc1ccc(cc1)-n1cc(CNCC2CCCCC2)c2ccccc12
: