Target
Steroid hormone receptor ERR1
Ligand
BDBM50336738
Substrate
Meas. Tech.
ChEMBL_718276 (CHEMBL1679580)
IC50
2300±n/a nM
Citation
 Patch, RJSearle, LLKim, AJDe, DZhu, XAskari, HBO'Neill, JCAbad, MCRentzeperis, DLiu, JKemmerer, MLin, LKasturi, JGeisler, JGLenhard, JMPlayer, MRGaul, MD Identification of diaryl ether-based ligands for estrogen-related receptora as potential antidiabetic agents. J Med Chem 54:788-808 (2012)  
Target
Name:
Steroid hormone receptor ERR1
Synonyms:
ERR-alpha ERR1_HUMAN ESRRA Estrogen-Related Receptor, alpha NR3B1 Steroid hormone receptor ERR1 Steroid hormone receptor ERR1/Estrogen-related receptor alpha (ERRa) | von Hippel-Lindau disease tumor suppressor/Steroid hormone receptor ERR1
Type:
PROTEIN
Mol. Mass.:
45508.08
Organism:
Homo sapiens (Human)
Description:
ChEMBL_1499891
Residue:
423
  
Inhibitor
Name:
BDBM50336738
Synonyms:
4-[4-(2,4-Dioxothiazolidin-5-ylidenemethyl)-2-methoxyphenoxy]-naphthalene-1-carbonitrile | CHEMBL1671981
Type:
Small organic molecule
Emp. Form.:
C22H14N2O4S
Mol. Mass.:
402.423
SMILES:
COc1cc(C=C2SC(O)=NC2=O)ccc1Oc1ccc(C#N)c2ccccc12
: