Target
Cytochrome P450 3A4
Ligand
BDBM50336753
Substrate
Meas. Tech.
ChEMBL_718343 (CHEMBL1679763)
IC50
2500±n/a nM
Citation
 Patch, RJSearle, LLKim, AJDe, DZhu, XAskari, HBO'Neill, JCAbad, MCRentzeperis, DLiu, JKemmerer, MLin, LKasturi, JGeisler, JGLenhard, JMPlayer, MRGaul, MD Identification of diaryl ether-based ligands for estrogen-related receptora as potential antidiabetic agents. J Med Chem 54:788-808 (2012)  
Target
Name:
Cytochrome P450 3A4
Synonyms:
Albendazole monooxygenase CP3A4_HUMAN CYP3A4 CYPIIIA4 Cytochrome P450 3A4 (CYP3A4) Nifedipine oxidase Taurochenodeoxycholate 6-alpha-hydroxylase
Type:
Enzyme
Mol. Mass.:
57349.57
Organism:
Homo sapiens (Human)
Description:
Residue:
503
  
Inhibitor
Name:
BDBM50336753
Synonyms:
4-[4-(2,4-Dioxothiazolidin-5-ylidenemethyl)-2-methoxyphenoxy]-3-chlorobenzoic Acid Methyl Ester | CHEMBL1671964
Type:
Small organic molecule
Emp. Form.:
C19H14ClNO6S
Mol. Mass.:
419.836
SMILES:
COC(=O)c1ccc(Oc2ccc(C=C3SC(O)=NC3=O)cc2OC)c(Cl)c1
: