Target
Steroid hormone receptor ERR1
Ligand
BDBM50336741
Substrate
Meas. Tech.
ChEMBL_718350 (CHEMBL1679770)
IC50
720±n/a nM
Citation
 Patch, RJSearle, LLKim, AJDe, DZhu, XAskari, HBO'Neill, JCAbad, MCRentzeperis, DLiu, JKemmerer, MLin, LKasturi, JGeisler, JGLenhard, JMPlayer, MRGaul, MD Identification of diaryl ether-based ligands for estrogen-related receptora as potential antidiabetic agents. J Med Chem 54:788-808 (2012)  
Target
Name:
Steroid hormone receptor ERR1
Synonyms:
ERR-alpha ERR1_HUMAN ESRRA Estrogen-Related Receptor, alpha NR3B1 Steroid hormone receptor ERR1 Steroid hormone receptor ERR1/Estrogen-related receptor alpha (ERRa) | von Hippel-Lindau disease tumor suppressor/Steroid hormone receptor ERR1
Type:
PROTEIN
Mol. Mass.:
45508.08
Organism:
Homo sapiens (Human)
Description:
ChEMBL_1499891
Residue:
423
  
Inhibitor
Name:
BDBM50336741
Synonyms:
4-[4-(2,4-Dioxothiazolidin-5-ylidenemethyl)phenoxy]-2-trifluoromethylbenzonitrile | CHEMBL1671984
Type:
Small organic molecule
Emp. Form.:
C18H9F3N2O3S
Mol. Mass.:
390.336
SMILES:
OC1=NC(=O)C(S1)=Cc1ccc(Oc2ccc(C#N)c(c2)C(F)(F)F)cc1
: