Target
Steroid hormone receptor ERR1
Ligand
BDBM50336743
Substrate
Meas. Tech.
ChEMBL_718350 (CHEMBL1679770)
IC50
350±n/a nM
Citation
 Patch, RJSearle, LLKim, AJDe, DZhu, XAskari, HBO'Neill, JCAbad, MCRentzeperis, DLiu, JKemmerer, MLin, LKasturi, JGeisler, JGLenhard, JMPlayer, MRGaul, MD Identification of diaryl ether-based ligands for estrogen-related receptora as potential antidiabetic agents. J Med Chem 54:788-808 (2012)  
Target
Name:
Steroid hormone receptor ERR1
Synonyms:
ERR-alpha ERR1_HUMAN ESRRA Estrogen-Related Receptor, alpha NR3B1 Steroid hormone receptor ERR1 Steroid hormone receptor ERR1/Estrogen-related receptor alpha (ERRa) | von Hippel-Lindau disease tumor suppressor/Steroid hormone receptor ERR1
Type:
PROTEIN
Mol. Mass.:
45508.08
Organism:
Homo sapiens (Human)
Description:
ChEMBL_1499891
Residue:
423
  
Inhibitor
Name:
BDBM50336743
Synonyms:
4-[4-(2,4-Dioxothiazolidin-5-ylidenemethyl)-2-ethoxyphenoxy]-2-trifluoromethylbenzonitrile | CHEMBL1671986
Type:
Small organic molecule
Emp. Form.:
C20H13F3N2O4S
Mol. Mass.:
434.388
SMILES:
CCOc1cc(C=C2SC(O)=NC2=O)ccc1Oc1ccc(C#N)c(c1)C(F)(F)F
: