Target
P2Y purinoceptor 4
Ligand
BDBM50268725
Substrate
Meas. Tech.
ChEMBL_718669 (CHEMBL1680820)
IC50
2220±n/a nM
Citation
 Baqi, YHausmann, RRosefort, CRettinger, JSchmalzing, GMüller, CE Discovery of potent competitive antagonists and positive modulators of the P2X2 receptor. J Med Chem 54:817-30 (2012)  
Target
Name:
P2Y purinoceptor 4
Synonyms:
NRU P2RY4 P2Y purinoceptor 4 Pyrimidinergic receptor P2Y4 Uridine nucleotide receptor
Type:
PROTEIN
Mol. Mass.:
40977.17
Organism:
Homo sapiens (Human)
Description:
ChEMBL_751027
Residue:
365
  
Inhibitor
Name:
BDBM50268725
Synonyms:
CHEMBL496030 | sodium 1-amino-4-(4-hydroxyphenylamino)-9,10-dioxo-9,10-dihydroanthracene-2-sulfonate
Type:
Small organic molecule
Emp. Form.:
C20H13N2O6S
Mol. Mass.:
409.393
SMILES:
Nc1c(cc(Nc2ccc(O)cc2)c2C(=O)c3ccccc3C(=O)c12)S([O-])(=O)=O
: