Target
P2Y purinoceptor 4
Ligand
BDBM50268874
Substrate
Meas. Tech.
ChEMBL_718669 (CHEMBL1680820)
IC50
1450±n/a nM
Citation
 Baqi, YHausmann, RRosefort, CRettinger, JSchmalzing, GMüller, CE Discovery of potent competitive antagonists and positive modulators of the P2X2 receptor. J Med Chem 54:817-30 (2012)  
Target
Name:
P2Y purinoceptor 4
Synonyms:
NRU P2RY4 P2Y purinoceptor 4 Pyrimidinergic receptor P2Y4 Uridine nucleotide receptor
Type:
PROTEIN
Mol. Mass.:
40977.17
Organism:
Homo sapiens (Human)
Description:
ChEMBL_751027
Residue:
365
  
Inhibitor
Name:
BDBM50268874
Synonyms:
CHEMBL499580 | Sodium 1-Amino-4-[3-(4,6-dichloro-[1,3,5]triazine-2-ylamino)-5-carboxyphenylamino]-9,10-dioxo-9,10-dihydroanthracene-2-sulfonate
Type:
Small organic molecule
Emp. Form.:
C24H13Cl2N6O7S
Mol. Mass.:
600.368
SMILES:
Nc1c(cc(Nc2cc(Nc3nc(Cl)nc(Cl)n3)cc(c2)C(O)=O)c2C(=O)c3ccccc3C(=O)c12)S([O-])(=O)=O
: