Target
Pleiotropic ABC efflux transporter of multiple drugs
Ligand
BDBM50017696
Substrate
Meas. Tech.
ChEMBL_730212 (CHEMBL1696307)
IC50
17700±n/a nM
Citation
 Kolaczkowski, MKolaczkowska, AMotohashi, NMichalak, K New high-throughput screening assay to reveal similarities and differences in inhibitory sensitivities of multidrug ATP-binding cassette transporters. Antimicrob Agents Chemother 53:1516-27 (2009)  
Target
Name:
Pleiotropic ABC efflux transporter of multiple drugs
Synonyms:
LEM1 PDR5_YEAST STS1 YDR1
Type:
PROTEIN
Mol. Mass.:
170453.87
Organism:
Saccharomyces cerevisiae S288c
Description:
ChEMBL_730212
Residue:
1511
  
Inhibitor
Name:
BDBM50017696
Synonyms:
(2-dimethylamino-2-methyl)ethyl-N-dibenzoparathiazine 10-[2-(dimethylamino)propyl]phenothiazine N,N,alpha-trimethyl-10H-phenothiazine-10-ethanamine PROMETHAZINE proazamine
Type:
Small organic molecule
Emp. Form.:
C17H20N2S
Mol. Mass.:
284.419
SMILES:
CC(CN1c2ccccc2Sc2ccccc12)N(C)C
: