Target
Tyrosine-protein phosphatase non-receptor type 22
Ligand
BDBM50343148
Substrate
Meas. Tech.
ChEMBL_745228 (CHEMBL1775822)
IC50
>50000±n/a nM
Citation
 Chen, LZhou, BZhang, SWu, LWang, YFranzblau, SGZhang, ZY Identification and characterization of novel inhibitors of mPTPB, an essential virulent phosphatase from Mycobacterium tuberculosis. ACS Med Chem Lett 1:355-359 (2010)  
Target
Name:
Tyrosine-protein phosphatase non-receptor type 22
Synonyms:
3.1.3.48 LyP Lymphoid phosphatase (Lyp) PEST-domain phosphatase PTPN22 Tyrosine-protein phosphatase non-receptor type 22 (LYP) | tyrosine-protein phosphatase non-receptor type 22 isoform 1
Type:
Mol. Mass.:
91712.31
Organism:
Homo sapiens (Human)
Description:
Q9Y2R2
Residue:
807
  
Inhibitor
Name:
BDBM50343148
Synonyms:
CHEMBL1773181 | N1-(1-(4-(4-fluorophenyl)piperazin-1-yl)-1-(thiophen-2-yl)propan-2-yl)-N2-(pyridin-3-ylmethyl)oxalamide
Type:
Small organic molecule
Emp. Form.:
C25H28FN5O2S
Mol. Mass.:
481.586
SMILES:
CC(NC(=O)C(=O)NCc1cccnc1)C(N1CCN(CC1)c1ccc(F)cc1)c1cccs1
: