Target
Dual specificity protein phosphatase CDC14A
Ligand
BDBM50343142
Substrate
Meas. Tech.
ChEMBL_745330 (CHEMBL1775405)
IC50
>50000±n/a nM
Citation
 Chen, LZhou, BZhang, SWu, LWang, YFranzblau, SGZhang, ZY Identification and characterization of novel inhibitors of mPTPB, an essential virulent phosphatase from Mycobacterium tuberculosis. ACS Med Chem Lett 1:355-359 (2010)  
Target
Name:
Dual specificity protein phosphatase CDC14A
Synonyms:
3.1.3.16 CC14A_HUMAN CDC14A
Type:
Mol. Mass.:
66598.40
Organism:
Homo sapiens (Human)
Description:
Q9UNH5
Residue:
594
  
Inhibitor
Name:
BDBM50343142
Synonyms:
CHEMBL1773168 | N-(4-butylphenyl)-2-oxo-1,2-dihydrobenzo[cd]indole-6-sulfonamide
Type:
Small organic molecule
Emp. Form.:
C21H20N2O3S
Mol. Mass.:
380.46
SMILES:
CCCCc1ccc(NS(=O)(=O)c2ccc3NC(=O)c4cccc2c34)cc1
: