Target
Dual specificity protein phosphatase CDC14A
Ligand
BDBM50343148
Substrate
Meas. Tech.
ChEMBL_745330 (CHEMBL1775405)
IC50
>50000±n/a nM
Citation
 Chen, LZhou, BZhang, SWu, LWang, YFranzblau, SGZhang, ZY Identification and characterization of novel inhibitors of mPTPB, an essential virulent phosphatase from Mycobacterium tuberculosis. ACS Med Chem Lett 1:355-359 (2010)  
Target
Name:
Dual specificity protein phosphatase CDC14A
Synonyms:
3.1.3.16 CC14A_HUMAN CDC14A
Type:
Mol. Mass.:
66598.40
Organism:
Homo sapiens (Human)
Description:
Q9UNH5
Residue:
594
  
Inhibitor
Name:
BDBM50343148
Synonyms:
CHEMBL1773181 | N1-(1-(4-(4-fluorophenyl)piperazin-1-yl)-1-(thiophen-2-yl)propan-2-yl)-N2-(pyridin-3-ylmethyl)oxalamide
Type:
Small organic molecule
Emp. Form.:
C25H28FN5O2S
Mol. Mass.:
481.586
SMILES:
CC(NC(=O)C(=O)NCc1cccnc1)C(N1CCN(CC1)c1ccc(F)cc1)c1cccs1
: