Target
Solute carrier family 22 member 6
Ligand
BDBM50269986
Substrate
Meas. Tech.
ChEMBL_749025 (CHEMBL1781810)
Ki
223000±n/a nM
Citation
 Kouznetsova, VLTsigelny, IFNagle, MANigam, SK Elucidation of common pharmacophores from analysis of targeted metabolites transported by the multispecific drug transporter-Organic anion transporter1 (Oat1). Bioorg Med Chem 19:3320-40 (2011)  
Target
Name:
Solute carrier family 22 member 6
Synonyms:
Nkt S22A6_MOUSE | Slc22a6
Type:
PROTEIN
Mol. Mass.:
60032.49
Organism:
Mus musculus
Description:
ChEMBL_508179
Residue:
545
  
Inhibitor
Name:
BDBM50269986
Synonyms:
3-(4-Hydroxyphenyl)lactate p-Hydroxyphenyllactate
Type:
Small organic molecule
Emp. Form.:
C9H9O4
Mol. Mass.:
181.1659
SMILES:
OC(Cc1ccc(O)cc1)C([O-])=O
: