Target
Transcriptional activator protein TraR
Ligand
BDBM50350706
Substrate
Meas. Tech.
ChEMBL_762769 (CHEMBL1816071)
IC50
2800±n/a nM
Citation
 McInnis, CEBlackwell, HE Thiolactone modulators of quorum sensing revealed through library design and screening. Bioorg Med Chem 19:4820-8 (2011)  
Target
Name:
Transcriptional activator protein TraR
Synonyms:
TRAR_RHIRD | traR
Type:
PROTEIN
Mol. Mass.:
26741.83
Organism:
Rhizobium radiobacter
Description:
ChEMBL_765233
Residue:
234
  
Inhibitor
Name:
BDBM50350706
Synonyms:
CHEMBL1811922
Type:
Small organic molecule
Emp. Form.:
C16H29NO2S
Mol. Mass.:
299.472
SMILES:
CCCCCCCCCCCC(=O)N[C@H]1CCSC1=O
: