Target
Sigma non-opioid intracellular receptor 1
Ligand
BDBM81982
Substrate
Meas. Tech.
ChEMBL_769558 (CHEMBL1833395)
Ki
61±n/a nM
Citation
 Schläger, TSchepmann, DLehmkuhl, KHolenz, JVela, JMBuschmann, HWünsch, B Combination of two pharmacophoric systems: synthesis and pharmacological evaluation of spirocyclic pyranopyrazoles with highs1 receptor affinity. J Med Chem 54:6704-13 (2011)  
Target
Name:
Sigma non-opioid intracellular receptor 1
Synonyms:
OPRS1 SIGMAR1 Sigma non-opioid intracellular receptor 1 Sigma1-receptor Sterol isomerase-like protein
Type:
Protein
Mol. Mass.:
25307.17
Organism:
Cavia porcellus (Guinea pig)
Description:
Q60492
Residue:
223
  
Inhibitor
Name:
BDBM81982
Synonyms:
CAS_97-39-2 DTG Tol2Gdn | cid_7333
Type:
Small organic molecule
Emp. Form.:
C15H17N3
Mol. Mass.:
239.3156
SMILES:
Cc1ccccc1NC(N)=Nc1ccccc1C
: