Target
Beta-1 adrenergic receptor
Ligand
BDBM50378915
Substrate
Meas. Tech.
ChEMBL_809479 (CHEMBL2015334)
IC50
0.2±n/a nM
Citation
 Radeke, HSPurohit, AHarris, TDHanson, KJones, RHu, CYalamanchili, PHayes, MYu, MGuaraldi, MKagan, MAzure, MCdebaca, MRobinson, SCasebier, D Synthesis and Cardiac Imaging of (18)F-Ligands Selective for ß1-Adrenoreceptors. ACS Med Chem Lett 2:650-655 (2011)  
Target
Name:
Beta-1 adrenergic receptor
Synonyms:
ADRB1 ADRB1_HUMAN Beta-1 adrenoceptor adrenergic Beta1
Type:
G Protein-Coupled Receptor (GPCR)
Mol. Mass.:
51338.40
Organism:
Homo sapiens (Human)
Description:
P08588
Residue:
477
  
Inhibitor
Name:
BDBM50378915
Synonyms:
CHEMBL2011214
Type:
Small organic molecule
Emp. Form.:
C19H21FN4O3
Mol. Mass.:
372.3934
SMILES:
O[C@@H](CNCCNC(=O)Nc1ccccc1F)COc1ccccc1C#N
: