Target
Serine/threonine-protein kinase Chk1
Ligand
BDBM50243262
Substrate
Meas. Tech.
ChEMBL_811468 (CHEMBL2013769)
IC50
800±n/a nM
Citation
 Oza, VAshwell, SBrassil, PBreed, JEzhuthachan, JDeng, CGrondine, MHorn, CLiu, DLyne, PNewcombe, NPass, MRead, JSu, MToader, DYu, DYu, YZabludoff, S Synthesis and evaluation of triazolones as checkpoint kinase 1 inhibitors. Bioorg Med Chem Lett 22:2330-7 (2012)  
Target
Name:
Serine/threonine-protein kinase Chk1
Synonyms:
CHEK1 CHK1 checkpoint homolog Checkpoint kinase-1 (CHK1)
Type:
Enzyme Catalytic Domain
Mol. Mass.:
54443.02
Organism:
Homo sapiens (Human)
Description:
gi_166295192
Residue:
476
  
Inhibitor
Name:
BDBM50243262
Synonyms:
5-METHYL[1,2,4]TRIAZOLO[4,3-A]QUINOLIN-1(2H)-ONE CHEMBL487274
Type:
Small organic molecule
Emp. Form.:
C11H9N3O
Mol. Mass.:
199.2087
SMILES:
Cc1cc2n[nH]c(=O)n2c2ccccc12
: