Target
5-hydroxytryptamine receptor 2C
Ligand
BDBM50007408
Substrate
Meas. Tech.
ChEMBL_809690 (CHEMBL2016001)
Ki
>10000±n/a nM
Citation
 Conway, RJValant, CChristopoulos, ARobertson, ADCapuano, BCrosby, IT Synthesis and SAR study of 4-arylpiperidines and 4-aryl-1,2,3,6-tetrahydropyridines as 5-HT2C agonists. Bioorg Med Chem Lett 22:2560-4 (2012)  
Target
Name:
5-hydroxytryptamine receptor 2C
Synonyms:
5-HT-1C 5-HT1C 5-HT2C-INI 5-HTR2C 5-hydroxytryptamine receptor 2C (5-HT-2C) 5HT-1C HTR1C Serotonin (5-HT3) receptor Serotonin Receptor 2C
Type:
G Protein-Coupled Receptor (GPCR)
Mol. Mass.:
51836.79
Organism:
Homo sapiens (Human)
Description:
P28335
Residue:
458
  
Inhibitor
Name:
BDBM50007408
Synonyms:
4-Phenyl-piperidine CHEMBL2011546 | CHEMBL20969
Type:
Small organic molecule
Emp. Form.:
C11H15N
Mol. Mass.:
161.2435
SMILES:
C1CC(CCN1)c1ccccc1
: