Target
Prostate-specific antigen
Ligand
BDBM50379839
Substrate
Meas. Tech.
ChEMBL_809739 (CHEMBL2016158)
IC50
226±n/a nM
Citation
 Liang, GChen, XAldous, SPu, SFMehdi, SPowers, EXia, TWang, R Human kallikrein 6 inhibitors with a para-amidobenzylanmine P1 group identified through virtual screening. Bioorg Med Chem Lett 22:2450-5 (2012)  
Target
Name:
Prostate-specific antigen
Synonyms:
APS KLK3 Kallikrein-3 PSA Prostate-specific antigen Seminin
Type:
PROTEIN
Mol. Mass.:
28747.53
Organism:
Homo sapiens (Human)
Description:
ChEMBL_959198
Residue:
261
  
Inhibitor
Name:
BDBM50379839
Synonyms:
CHEMBL2011751
Type:
Small organic molecule
Emp. Form.:
C33H27NO8
Mol. Mass.:
565.5694
SMILES:
Oc1ccc(C[C@H]2[C@H](N(C(=O)Oc3cccc(c3)C(=O)OCc3ccccc3)C2=O)C(=O)OCc2ccccc2)cc1
: