Target
Angiopoietin-1 receptor
Ligand
BDBM22890
Substrate
Meas. Tech.
ChEMBL_810765 (CHEMBL2016084)
Kd
90000±n/a nM
Citation
 Gong, XWMai, JHXu, YH Discovery of loperamide as an antagonist of angiopoietin1 and angiopoietin2 by virtual screening. Bioorg Med Chem Lett 22:2388-92 (2012)  
Target
Name:
Angiopoietin-1 receptor
Synonyms:
TEK TIE2_HUMAN Tyrosine-protein kinase receptor (TIE-2) Tyrosine-protein kinase receptor TEK (p140 TEK) Tyrosine-protein kinase receptor TIE2/TEK VMCM1 p140 TEK
Type:
Enzyme
Mol. Mass.:
125835.70
Organism:
Homo sapiens (Human)
Description:
Q02763
Residue:
1124
  
Inhibitor
Name:
BDBM22890
Synonyms:
2-(2-{4-[(4-chlorophenyl)(phenyl)methyl]piperazin-1-yl}ethoxy)acetic acid Cetirizine | Levocetirizine
Type:
Small organic molecule
Emp. Form.:
C21H25ClN2O3
Mol. Mass.:
388.888
SMILES:
OC(=O)COCCN1CCN(CC1)C(c1ccccc1)c1ccc(Cl)cc1
: