Target
Serine/threonine-protein kinase mTOR
Ligand
BDBM50380313
Substrate
Meas. Tech.
ChEMBL_813832 (CHEMBL2020201)
Ki
16±n/a nM
Citation
 Liu, KKZhu, JSmith, GLYin, MJBailey, SChen, JHHu, QHuang, QLi, CLi, QJMarx, MAPaderes, GRichardson, PFSach, NWWalls, MWells, PABaxi, SZou, A Highly Selective and Potent Thiophenes as PI3K Inhibitors with Oral Antitumor Activity. ACS Med Chem Lett 2:809-813 (2011)  
Target
Name:
Serine/threonine-protein kinase mTOR
Synonyms:
FK506-binding protein 12-rapamycin complex-associated protein 1 FRAP FRAP1 MTOR Mammalian Target of Rapamycin (mTOR) RAFT1 Rapamycin and FKBP12 target 1 Serine/threonine-protein kinase (mTOR) | mTORC2
Type:
Rapamycin target protein
Mol. Mass.:
288917.12
Organism:
Homo sapiens (Human)
Description:
P42345
Residue:
2549
  
Inhibitor
Name:
BDBM50380313
Synonyms:
CHEMBL1234354 | US8633204, 286
Type:
Small organic molecule
Emp. Form.:
C22H27N5O4
Mol. Mass.:
425.4809
SMILES:
COc1ccc(cn1)-c1cc2c(C)nc(N)nc2n([C@H]2CC[C@@H](CC2)OCCO)c1=O
: