Target
cGMP-inhibited 3',5'-cyclic phosphodiesterase 3A
Ligand
BDBM50380650
Substrate
Meas. Tech.
ChEMBL_813180 (CHEMBL2020846)
Ki
954±n/a nM
Citation
 Ho, GDMichael Seganish, WBercovici, ATulshian, DGreenlee, WJVan Rijn, RHruza, AXiao, LRindgen, DMullins, DGuzzi, MZhang, XBleickardt, CHodgson, R The SAR development of dihydroimidazoisoquinoline derivatives as phosphodiesterase 10A inhibitors for the treatment of schizophrenia. Bioorg Med Chem Lett 22:2585-9 (2012)  
Target
Name:
cGMP-inhibited 3',5'-cyclic phosphodiesterase 3A
Synonyms:
3',5'-cyclic phosphodiesterase Cyclic GMP-inhibited phosphodiesterase A PDE3A_HUMAN Phosphodiesterase 3 (PDE3) Phosphodiesterase 3A Phosphodiesterase 3A (PDE3A1) cGMP-inhibited 3',5'-cyclic phosphodiesterase A | cGMP-inhibited 3,5-cyclic phosphodiesterase A
Type:
Enzyme
Mol. Mass.:
124966.46
Organism:
Homo sapiens (Human)
Description:
Q14432
Residue:
1141
  
Inhibitor
Name:
BDBM50380650
Synonyms:
CHEMBL2017075
Type:
Small organic molecule
Emp. Form.:
C19H17ClN2O2
Mol. Mass.:
340.803
SMILES:
COc1cc2CCn3cnc(c3-c2cc1OC)-c1cccc(Cl)c1
: