Target
Carbonic anhydrase 1
Ligand
BDBM50028962
Substrate
Meas. Tech.
ChEMBL_814440 (CHEMBL2019836)
Ki
1890±n/a nM
Citation
 Balboni, GCongiu, COnnis, VMaresca, AScozzafava, AWinum, JYMaietti, ASupuran, CT Flavones and structurally related 4-chromenones inhibit carbonic anhydrases by a different mechanism of action compared to coumarins. Bioorg Med Chem Lett 22:3063-6 (2012)  
Target
Name:
Carbonic anhydrase 1
Synonyms:
CA-I CAB Carbonate dehydratase I Carbonic anhydrase 1 (CA I) Carbonic anhydrase 1 (Recombinant CA I) Carbonic anhydrase B Carbonic anhydrase I (CA I) Carbonic anhydrase I (CAI) Carbonic anhydrase isoenzyme I (hCA I) | hCA
Type:
Enzyme
Mol. Mass.:
28873.37
Organism:
Homo sapiens (Human)
Description:
P00915
Residue:
261
  
Inhibitor
Name:
BDBM50028962
Synonyms:
CHEMBL275638 | flavone
Type:
Small organic molecule
Emp. Form.:
C15H10O2
Mol. Mass.:
222.2387
SMILES:
O=c1cc(oc2ccccc12)-c1ccccc1
: