Target
D(3) dopamine receptor
Ligand
BDBM50382294
Substrate
Meas. Tech.
ChEMBL_816863 (CHEMBL2026134)
IC50
4.8±n/a nM
Citation
 Agai-Csongor, EDomány, GNógrádi, KGalambos, JVágó, IKeseru, GMGreiner, ILaszlovszky, IGere, ASchmidt, EKiss, BVastag, MTihanyi, KSághy, KLaszy, JGyertyán, IZájer-Balázs, MGémesi, LKapás, MSzombathelyi, Z Discovery of cariprazine (RGH-188): a novel antipsychotic acting on dopamine D3/D2 receptors. Bioorg Med Chem Lett 22:3437-40 (2012)  
Target
Name:
D(3) dopamine receptor
Synonyms:
DOPAMINE D3 Dopamine D3 receptor | Drd3
Type:
Protein
Mol. Mass.:
49540.58
Organism:
Rattus norvegicus (Rat)
Description:
P19020
Residue:
446
  
Inhibitor
Name:
BDBM50382294
Synonyms:
CHEMBL2024510
Type:
Small organic molecule
Emp. Form.:
C20H30F3N3O2S
Mol. Mass.:
433.531
SMILES:
CS(=O)(=O)N[C@H]1CC[C@H](CCN2CCN(CC2)c2cccc(c2)C(F)(F)F)CC1
: