Target
Adenosine receptor A1
Ligand
BDBM50382496
Substrate
Meas. Tech.
ChEMBL_816162 (CHEMBL2024728)
Ki
117.49±n/a nM
Citation
 Congreve, MAndrews, SPDoré, ASHollenstein, KHurrell, ELangmead, CJMason, JSNg, IWTehan, BZhukov, AWeir, MMarshall, FH Discovery of 1,2,4-triazine derivatives as adenosine A(2A) antagonists using structure based drug design. J Med Chem 55:1898-903 (2012)  
Target
Name:
Adenosine receptor A1
Synonyms:
A1 adenosine receptor (hA1) AA1R_HUMAN ADORA1 Adenosine A1-receptor Adenosine receptor A1 (hA1) | Adenosine transporter (AdT)
Type:
G Protein-Coupled Receptor (GPCR)
Mol. Mass.:
36520.92
Organism:
Homo sapiens (Human)
Description:
P30542
Residue:
326
  
Inhibitor
Name:
BDBM50382496
Synonyms:
CHEMBL2024120 | US10988455, Example 1(cxciii)
Type:
Small organic molecule
Emp. Form.:
C16H11F4N5
Mol. Mass.:
349.2857
SMILES:
Cc1cc(cc(n1)C(F)(F)F)-c1nnc(N)nc1-c1ccc(F)cc1
: