Target
Bifunctional epoxide hydrolase 2
Ligand
BDBM50383462
Substrate
Meas. Tech.
ChEMBL_818494 (CHEMBL2032586)
IC50
0.5±n/a nM
Citation
 Scherman, MSNorth, EJJones, VHess, TNGrzegorzewicz, AEKasagami, TKim, IHMerzlikin, OLenaerts, AJLee, REJackson, MMorisseau, CMcNeil, MR Screening a library of 1600 adamantyl ureas for anti-Mycobacterium tuberculosis activity in vitro and for better physical chemical properties for bioavailability. Bioorg Med Chem 20:3255-62 (2012)  
Target
Name:
Bifunctional epoxide hydrolase 2
Synonyms:
Cytosolic epoxide hydrolase 2 EPHX2 HYES_HUMAN Soluble epoxide hydrolase (sEH) | epoxide hydrolase 2, cytoplasmic
Type:
Enzyme
Mol. Mass.:
62613.07
Organism:
Homo sapiens (Human)
Description:
P34913
Residue:
555
  
Inhibitor
Name:
BDBM50383462
Synonyms:
CHEMBL2031797
Type:
Small organic molecule
Emp. Form.:
C17H21IN2O
Mol. Mass.:
396.2659
SMILES:
Ic1ccc(NC(=O)NC23CC4CC(CC(C4)C2)C3)cc1
: