Target
Bifunctional epoxide hydrolase 2
Ligand
BDBM50196661
Substrate
Meas. Tech.
ChEMBL_818494 (CHEMBL2032586)
IC50
0.8±n/a nM
Citation
 Scherman, MSNorth, EJJones, VHess, TNGrzegorzewicz, AEKasagami, TKim, IHMerzlikin, OLenaerts, AJLee, REJackson, MMorisseau, CMcNeil, MR Screening a library of 1600 adamantyl ureas for anti-Mycobacterium tuberculosis activity in vitro and for better physical chemical properties for bioavailability. Bioorg Med Chem 20:3255-62 (2012)  
Target
Name:
Bifunctional epoxide hydrolase 2
Synonyms:
Cytosolic epoxide hydrolase 2 EPHX2 HYES_HUMAN Soluble epoxide hydrolase (sEH) | epoxide hydrolase 2, cytoplasmic
Type:
Enzyme
Mol. Mass.:
62613.07
Organism:
Homo sapiens (Human)
Description:
P34913
Residue:
555
  
Inhibitor
Name:
BDBM50196661
Synonyms:
12-(3-adamantan-1-yl-ureido)-dodecanoic acid butyl ester CHEMBL223281
Type:
Small organic molecule
Emp. Form.:
C27H48N2O3
Mol. Mass.:
448.6816
SMILES:
CCCCOC(=O)CCCCCCCCCCCNC(=O)NC12CC3CC(CC(C3)C1)C2
: