Target
Bifunctional epoxide hydrolase 2
Ligand
BDBM50383503
Substrate
Meas. Tech.
ChEMBL_818494 (CHEMBL2032586)
IC50
1±n/a nM
Citation
 Scherman, MSNorth, EJJones, VHess, TNGrzegorzewicz, AEKasagami, TKim, IHMerzlikin, OLenaerts, AJLee, REJackson, MMorisseau, CMcNeil, MR Screening a library of 1600 adamantyl ureas for anti-Mycobacterium tuberculosis activity in vitro and for better physical chemical properties for bioavailability. Bioorg Med Chem 20:3255-62 (2012)  
Target
Name:
Bifunctional epoxide hydrolase 2
Synonyms:
Cytosolic epoxide hydrolase 2 EPHX2 HYES_HUMAN Soluble epoxide hydrolase (sEH) | epoxide hydrolase 2, cytoplasmic
Type:
Enzyme
Mol. Mass.:
62613.07
Organism:
Homo sapiens (Human)
Description:
P34913
Residue:
555
  
Inhibitor
Name:
BDBM50383503
Synonyms:
CHEMBL2031950
Type:
Small organic molecule
Emp. Form.:
C24H32N2O3
Mol. Mass.:
396.5225
SMILES:
O=C(N[C@H]1CC[C@@H](CC1)OC(=O)c1ccccc1)NC12CC3CC(CC(C3)C1)C2
: