Target
Bifunctional epoxide hydrolase 2
Ligand
BDBM50217470
Substrate
Meas. Tech.
ChEMBL_818494 (CHEMBL2032586)
IC50
1.1±n/a nM
Citation
 Scherman, MSNorth, EJJones, VHess, TNGrzegorzewicz, AEKasagami, TKim, IHMerzlikin, OLenaerts, AJLee, REJackson, MMorisseau, CMcNeil, MR Screening a library of 1600 adamantyl ureas for anti-Mycobacterium tuberculosis activity in vitro and for better physical chemical properties for bioavailability. Bioorg Med Chem 20:3255-62 (2012)  
Target
Name:
Bifunctional epoxide hydrolase 2
Synonyms:
Cytosolic epoxide hydrolase 2 EPHX2 HYES_HUMAN Soluble epoxide hydrolase (sEH) | epoxide hydrolase 2, cytoplasmic
Type:
Enzyme
Mol. Mass.:
62613.07
Organism:
Homo sapiens (Human)
Description:
P34913
Residue:
555
  
Inhibitor
Name:
BDBM50217470
Synonyms:
CHEMBL395988 | trans-1-adamantan-1-yl-3-(4-benzyloxycyclohexyl)urea
Type:
Small organic molecule
Emp. Form.:
C24H34N2O2
Mol. Mass.:
382.539
SMILES:
O=C(N[C@H]1CC[C@@H](CC1)OCc1ccccc1)NC12CC3CC(CC(C3)C1)C2
: