Target
Bifunctional epoxide hydrolase 2
Ligand
BDBM50217451
Substrate
Meas. Tech.
ChEMBL_818494 (CHEMBL2032586)
IC50
0.8±n/a nM
Citation
 Scherman, MSNorth, EJJones, VHess, TNGrzegorzewicz, AEKasagami, TKim, IHMerzlikin, OLenaerts, AJLee, REJackson, MMorisseau, CMcNeil, MR Screening a library of 1600 adamantyl ureas for anti-Mycobacterium tuberculosis activity in vitro and for better physical chemical properties for bioavailability. Bioorg Med Chem 20:3255-62 (2012)  
Target
Name:
Bifunctional epoxide hydrolase 2
Synonyms:
Cytosolic epoxide hydrolase 2 EPHX2 HYES_HUMAN Soluble epoxide hydrolase (sEH) | epoxide hydrolase 2, cytoplasmic
Type:
Enzyme
Mol. Mass.:
62613.07
Organism:
Homo sapiens (Human)
Description:
P34913
Residue:
555
  
Inhibitor
Name:
BDBM50217451
Synonyms:
CHEMBL427695 | trans-1-adamantan-1-yl-3-[4-(4-methoxyphenoxy)cyclohexyl]-urea
Type:
Small organic molecule
Emp. Form.:
C24H34N2O3
Mol. Mass.:
398.5384
SMILES:
COc1ccc(O[C@H]2CC[C@@H](CC2)NC(=O)NC23CC4CC(CC(C4)C2)C3)cc1
: