Target
Arachidonate 5-lipoxygenase-activating protein
Ligand
BDBM50383891
Substrate
Meas. Tech.
ChEMBL_819515 (CHEMBL2033320)
IC50
96±n/a nM
Citation
 Chu, LArmstrong, HMChang, LLCheng, AFColwell, LCui, JEvans, JGalka, AGoulet, MTHayes, NLo, JMenke, JOk, HOOndeyka, DLPatel, MQuaker, GMSings, HWitkin, SLZhao, AUjjainwalla, F Evaluation of endo- and exo-aryl-substitutions and central scaffold modifications on diphenyl substituted alkanes as 5-lipoxygenase activating protein inhibitors. Bioorg Med Chem Lett 22:4133-8 (2012)  
Target
Name:
Arachidonate 5-lipoxygenase-activating protein
Synonyms:
5-lipoxygenase activating protein 5-lipoxygenase/FLAP ALOX5AP MK-886-binding protein
Type:
Enzyme
Mol. Mass.:
18159.90
Organism:
Homo sapiens (Human)
Description:
P20292
Residue:
161
  
Inhibitor
Name:
BDBM50383891
Synonyms:
CHEMBL2031445
Type:
Small organic molecule
Emp. Form.:
C29H29NO3
Mol. Mass.:
439.5455
SMILES:
CCC(CC)(c1ccccc1)c1cc(OCc2ccc3ccccc3n2)ccc1C(=O)OC
: