Target
Arachidonate 5-lipoxygenase-activating protein
Ligand
BDBM50383912
Substrate
Meas. Tech.
ChEMBL_819515 (CHEMBL2033320)
IC50
2.8±n/a nM
Citation
 Chu, LArmstrong, HMChang, LLCheng, AFColwell, LCui, JEvans, JGalka, AGoulet, MTHayes, NLo, JMenke, JOk, HOOndeyka, DLPatel, MQuaker, GMSings, HWitkin, SLZhao, AUjjainwalla, F Evaluation of endo- and exo-aryl-substitutions and central scaffold modifications on diphenyl substituted alkanes as 5-lipoxygenase activating protein inhibitors. Bioorg Med Chem Lett 22:4133-8 (2012)  
Target
Name:
Arachidonate 5-lipoxygenase-activating protein
Synonyms:
5-lipoxygenase activating protein 5-lipoxygenase/FLAP ALOX5AP MK-886-binding protein
Type:
Enzyme
Mol. Mass.:
18159.90
Organism:
Homo sapiens (Human)
Description:
P20292
Residue:
161
  
Inhibitor
Name:
BDBM50383912
Synonyms:
CHEMBL2031653
Type:
Small organic molecule
Emp. Form.:
C31H29N5O
Mol. Mass.:
487.5949
SMILES:
Cn1nnc(n1)-c1ccc(OCc2ccc3ccccc3n2)cc1[C@@]1(C[C@H]2CC[C@H]1C2)c1ccccc1
: