Target
Mitogen-activated protein kinase 14
Ligand
BDBM50384385
Substrate
Meas. Tech.
ChEMBL_818324 (CHEMBL2034461)
IC50
110±n/a nM
Citation
 Brown, DSCumming, JGBethel, PFinlayson, JGerhardt, SNash, IPauptit, RAPike, KGReid, ASnelson, WSwallow, SThompson, C The discovery of N-cyclopropyl-4-methyl-3-[6-(4-methylpiperazin-1-yl)-4-oxoquinazolin-3(4H)-yl]benzamide (AZD6703), a clinical p38a MAP kinase inhibitor for the treatment of inflammatory diseases. Bioorg Med Chem Lett 22:3879-83 (2012)  
Target
Name:
Mitogen-activated protein kinase 14
Synonyms:
CSAID-binding protein CSBP1 CSPB1 MAP kinase 14 MAP kinase p38 alpha MAPK14 MK14_HUMAN Mitogen-activated protein kinase p38 alpha Stress-activated protein kinase 2a | p38 MAP kinase alpha/beta
Type:
Serine/threonine-protein kinase
Mol. Mass.:
41286.76
Organism:
Homo sapiens (Human)
Description:
Q16539
Residue:
360
  
Inhibitor
Name:
BDBM50384385
Synonyms:
CHEMBL2031238
Type:
Small organic molecule
Emp. Form.:
C25H25N5O3
Mol. Mass.:
443.4977
SMILES:
CN1CCN(CC1)c1ccc2ncn(-c3cc(NC(=O)c4ccoc4)ccc3C)c(=O)c2c1
: