Target
Mitogen-activated protein kinase 14
Ligand
BDBM50153846
Substrate
Meas. Tech.
ChEMBL_818343 (CHEMBL2034480)
IC50
25.12±n/a nM
Citation
 Brown, DSCumming, JGBethel, PFinlayson, JGerhardt, SNash, IPauptit, RAPike, KGReid, ASnelson, WSwallow, SThompson, C The discovery of N-cyclopropyl-4-methyl-3-[6-(4-methylpiperazin-1-yl)-4-oxoquinazolin-3(4H)-yl]benzamide (AZD6703), a clinical p38a MAP kinase inhibitor for the treatment of inflammatory diseases. Bioorg Med Chem Lett 22:3879-83 (2012)  
Target
Name:
Mitogen-activated protein kinase 14
Synonyms:
CSAID-binding protein CSBP1 CSPB1 MAP kinase 14 MAP kinase p38 alpha MAPK14 MK14_HUMAN Mitogen-activated protein kinase p38 alpha Stress-activated protein kinase 2a | p38 MAP kinase alpha/beta
Type:
Serine/threonine-protein kinase
Mol. Mass.:
41286.76
Organism:
Homo sapiens (Human)
Description:
Q16539
Residue:
360
  
Inhibitor
Name:
BDBM50153846
Synonyms:
4-methyl-1-[3-(1,4-oxazinan-4-yl)phenylcarboxamido]-3-[4-(1,3-thiazol-4-ylmethoxy)phenylcarboxamido]benzene | CHEMBL183630
Type:
Small organic molecule
Emp. Form.:
C29H28N4O4S
Mol. Mass.:
528.622
SMILES:
Cc1ccc(NC(=O)c2cccc(c2)N2CCOCC2)cc1NC(=O)c1ccc(OCc2cscn2)cc1
: