Target
Orexin receptor type 2
Ligand
BDBM50384431
Substrate
Meas. Tech.
ChEMBL_818373 (CHEMBL2034510)
IC50
62±n/a nM
Citation
 Jiang, RSong, XBali, PSmith, ABayona, CRLin, LCameron, MDMcDonald, PHKenny, PJKamenecka, TM Disubstituted piperidines as potent orexin (hypocretin) receptor antagonists. Bioorg Med Chem Lett 22:3890-4 (2012)  
Target
Name:
Orexin receptor type 2
Synonyms:
HCRTR2 OX2R_HUMAN Orexin receptor type 2 (OR-2) Orexin receptor type 2 (OX2R) Ox-2-R | Ox2-R
Type:
Protein
Mol. Mass.:
50710.53
Organism:
Homo sapiens (Human)
Description:
O43614
Residue:
444
  
Inhibitor
Name:
BDBM50384431
Synonyms:
CHEMBL2031494
Type:
Small organic molecule
Emp. Form.:
C29H27N3O3
Mol. Mass.:
465.543
SMILES:
O[C@@H]1CCN([C@H](CNC(=O)c2cccc3cccnc23)C1)C(=O)c1ccccc1-c1ccccc1
: