Target
Receptor-type tyrosine-protein kinase FLT3
Ligand
BDBM50384725
Substrate
Meas. Tech.
ChEMBL_820932 (CHEMBL2038873)
IC50
4700±n/a nM
Citation
 Albaugh, PFan, YMi, YSun, FAdrian, FLi, NJia, YSarkisova, YKreusch, AHood, TLu, MLiu, GHuang, SLiu, ZLoren, JTuntland, TKaranewsky, DSSeidel, HMMolteni, V Discovery of GNF-5837, a Selective TRK Inhibitor with Efficacy in Rodent Cancer Tumor Models. ACS Med Chem Lett 3:140-145 (2012)  
Target
Name:
Receptor-type tyrosine-protein kinase FLT3
Synonyms:
CD_antigen=CD135 FLT3_MOUSE Flk-2 Flt3 Tyrosine-protein kinase receptor flk-2
Type:
PROTEIN
Mol. Mass.:
113492.59
Organism:
Mus musculus
Description:
ChEMBL_104536
Residue:
1000
  
Inhibitor
Name:
BDBM50384725
Synonyms:
CHEMBL2037209
Type:
Small organic molecule
Emp. Form.:
C31H23F3N6O2
Mol. Mass.:
568.5485
SMILES:
Cc1cn(cn1)-c1cc(cc(c1)C(F)(F)F)C(=O)Nc1cccc(Nc2ccc3\C(=C\c4ccc[nH]4)C(=O)Nc3c2)c1
: