Target
Receptor-type tyrosine-protein kinase FLT3
Ligand
BDBM50384727
Substrate
Meas. Tech.
ChEMBL_820932 (CHEMBL2038873)
IC50
5100±n/a nM
Citation
 Albaugh, PFan, YMi, YSun, FAdrian, FLi, NJia, YSarkisova, YKreusch, AHood, TLu, MLiu, GHuang, SLiu, ZLoren, JTuntland, TKaranewsky, DSSeidel, HMMolteni, V Discovery of GNF-5837, a Selective TRK Inhibitor with Efficacy in Rodent Cancer Tumor Models. ACS Med Chem Lett 3:140-145 (2012)  
Target
Name:
Receptor-type tyrosine-protein kinase FLT3
Synonyms:
CD_antigen=CD135 FLT3_MOUSE Flk-2 Flt3 Tyrosine-protein kinase receptor flk-2
Type:
PROTEIN
Mol. Mass.:
113492.59
Organism:
Mus musculus
Description:
ChEMBL_104536
Residue:
1000
  
Inhibitor
Name:
BDBM50384727
Synonyms:
CHEMBL2037226
Type:
Small organic molecule
Emp. Form.:
C28H21F4N5O2
Mol. Mass.:
535.4923
SMILES:
Cc1ccc(NC(=O)Nc2cc(ccc2F)C(F)(F)F)cc1Nc1ccc2\C(=C\c3ccc[nH]3)C(=O)Nc2c1
: