Target
Serine/threonine-protein kinase pim-1
Ligand
BDBM50385082
Substrate
Meas. Tech.
ChEMBL_821478 (CHEMBL2038008)
IC50
27±n/a nM
Citation
 Tsuhako, ALBrown, DSKoltun, ESAay, NArcalas, AChan, VDu, HEngst, SFranzini, MGalan, AHuang, PJohnston, SKane, BKim, MHLaird, ADLin, RMock, LNgan, IPack, MStott, GStout, TJYu, PZaharia, CZhang, WZhou, PNuss, JMKearney, PCXu, W The design, synthesis, and biological evaluation of PIM kinase inhibitors. Bioorg Med Chem Lett 22:3732-8 (2012)  
Target
Name:
Serine/threonine-protein kinase pim-1
Synonyms:
PIM-1 Kinase PIM1_HUMAN Serine/threonine-protein kinase (PIM1) Serine/threonine-protein kinase PIM1 | Serine/threonine-protein kinase pim-1 (PIM1)
Type:
Protein
Mol. Mass.:
35681.82
Organism:
Homo sapiens (Human)
Description:
P11309
Residue:
313
  
Inhibitor
Name:
BDBM50385082
Synonyms:
CHEMBL2035633
Type:
Small organic molecule
Emp. Form.:
C16H17BrN4O2
Mol. Mass.:
377.236
SMILES:
CN1CCN(Cc2nc3c4cc(Br)ccc4oc3c(=O)[nH]2)CC1
: