Target
Prostaglandin E2 receptor EP2 subtype
Ligand
BDBM50385141
Substrate
Meas. Tech.
ChEMBL_822927 (CHEMBL2038098)
Ki
1.5±n/a nM
Citation
 Kambe, TMaruyama, TNakai, YOida, HMaruyama, TAbe, NNishiura, ANakai, HToda, M Synthesis and evaluation of¿-lactam analogs of PGE2 as EP4 and EP2/EP4 agonists. Bioorg Med Chem 20:3502-22 (2012)  
Target
Name:
Prostaglandin E2 receptor EP2 subtype
Synonyms:
PE2R2_MOUSE Prostaglandin E2 Prostanoid EP2 receptor Ptgerep2
Type:
G-protein coupled receptor
Mol. Mass.:
40495.26
Organism:
Mus musculus (Mouse)
Description:
Residue:
362
  
Inhibitor
Name:
BDBM50385141
Synonyms:
CHEMBL2036321
Type:
Small organic molecule
Emp. Form.:
C28H30N2O4S2
Mol. Mass.:
522.679
SMILES:
Cc1ccc(cc1C)-c1cccc(C[C@H](O)\C=C\[C@H]2CCC(=O)N2CCSc2nc(cs2)C(O)=O)c1
: