Target
Peroxisome proliferator-activated receptor alpha
Ligand
BDBM50194627
Substrate
Meas. Tech.
ChEMBL_822292 (CHEMBL2038446)
IC50
8260.38±n/a nM
Citation
 Méndez-Lucio, OPérez-Villanueva, JCastillo, RMedina-Franco, JL Activity landscape modeling of PPAR ligands with dual-activity difference maps. Bioorg Med Chem 20:3523-32 (2012)  
Target
Name:
Peroxisome proliferator-activated receptor alpha
Synonyms:
NR1C1 PPAR PPAR-alpha PPARA_HUMAN Peroxisome proliferator-activated receptor | Peroxisome proliferator-activated receptor alpha (PPAR alpha)
Type:
Enzyme
Mol. Mass.:
52222.08
Organism:
Homo sapiens (Human)
Description:
Q07869
Residue:
468
  
Inhibitor
Name:
BDBM50194627
Synonyms:
(R)-3-(4-(3-(2-benzoyl-4-ethylphenoxy)butoxy)-2-methylphenyl)propanoic acid CHEMBL212911
Type:
Small organic molecule
Emp. Form.:
C29H32O5
Mol. Mass.:
460.5614
SMILES:
CCc1ccc(O[C@H](C)CCOc2ccc(CCC(O)=O)c(C)c2)c(c1)C(=O)c1ccccc1
: